Undefined Reference To Collect2 Error Ld Returned 1 Exit Status

RECOMMENDED: If you have Windows errors then we strongly recommend that you download and run this (Windows) Repair Tool.

A few months back, a $3000 thunder and lightning mood lamp went viral in the maker community. It was a stunningly beautiful light, but the price tag left it out of the reach of anyone with their sanity intact. What we’ll make today isn’t.

. undefined reference to ` implicitzm0zi0zi2_GraphicsziImplicitziExportziTextBuilderUtils_zdwbuildTruncFloat_closure ' collect2: error: ld returned 1 exit status

Collect2.exe:-1: error: error: ld returned 1 exit status. -1: error: undefined reference to `gsl_sf. undefined reference to `gsl_sf_bessel_J0' collect2.exe.

Undefined reference to main – collect2: ld. ld will report "undefined reference. "undefined reference to `pow' collect2: error: ld returned 1 exit status.

OpenCV is a suite of powerful computer vision tools. Here is a quick overview of how I installed OpenCV on my Raspberry Pi with debian6-19-04-2012.

. undefined reference to 'GameLoop::. collect2: error: ld returned 1 exit status Here is the part of my code where I'm assuming my error is:

[SOLVED] collect2: error: ld returned 1 exit status – LinuxQuestions – /tmp/ccYeJqKe.o: In function `main': test.c:(.text+0x12): undefined reference to ` npth_init' collect2: error: ld returned 1 exit status. The source is.

I am getting an error which relates to undefined reference to a function. collect2: ld returned 1 exit status make: *** [linux_i32/globchat] Error 1

In one of our last tutorials we have installed WhatsApp on Raspberry. Whatsapp at the moment is definitely the most famous app for messaging services, but there are.

Print Spooler Error 1068 Dependency Error 1068: the dependency service or group failed to start. – Error 1068. The Dependency service or group failed to start. Go to dependency and make sure all those are started. 99% of the time one of those. I am using windows xp and have attempted to download a printer driver but I get a

/tmp/cckmTBn0.o: In function `myinit': points.c.text+0x10d): undefined reference to `gluOrtho2D' collect2: ld returned 1 exit status. The program.

Sep 4, 2014. Summary, make is failing – collect2: error: ld returned 1 exit status. undefined reference to `rtnl_link_put' wireshark-ws80211_utils.o: In.

Dec 28, 2004. collect2: ld returned 1 exit status — usually found as the last line of the error. This phrase indicates that you have a linker (ld) error, not a compiler error. Linker. This is a special case of "undefined reference"; Usual Causes.

0706-317 ERROR: Unresolved or undefined symbols detected. to the line defining GCOMP_PETSCFLAGS and OCOMP_PETSCFLAGS. – ld: /lib/libm.a(trig.o): _fp_pi: multiply defined *** Error code 1 (ignored) Problem: the.

Jul 27, 2016. Can`t compile my C++ program on Linux (undefined reference). follow collect2: error: ld returned 1 exit status make: *** [Prueba1] Error 1.

RFC 4217 defines FTP over SSL/TLS: http://www.faqs.org/rfcs/rfc4217.html The mod_tls module for proftpd is an implementation of RFC 4217. RFC 2228 defines FTP.

Sep 19, 2017  · IntroductionBACK TO TOC. In this article I would like to continue subject I started in my previous two posts (post 1 and post2). Question I am trying to answer is.

c -. undefined reference to. collect2: ld returned 1 exit. –. undefined reference to. collect2: ld returned 1 exit status. collect2: error: ld returned 1 exit status. 0. c. undefined reference returning exit status. 0.

Hi, I get: capture-pcap-util.c:620: error: static declaration of ‘pcap. main’: /home/ericsson/ewireshark/trunk/conftest.c:74: undefined reference to `pcap_open_dead’ collect2: ld returned 1 exit status Comparing with Ubuntu there is these.

. undefined reference to. undefined reference to `pthread_create' collect2: error: ld returned 1 exit status. Error 1 When I change the 5th line (LD.

So, that means there’s 1.7KW of electrical energy in every liter of gasoline to go through the engine. Now, with the indicators needing 0.08W, 0.000008L of gasoline can provide that energy, but when you’re using a system with 17.5%.

RECOMMENDED: Click here to fix Windows errors and improve system performance