Error While Loading Shared Libraries Libz.so.1 Ubuntu

RECOMMENDED: If you have Windows errors then we strongly recommend that you download and run this (Windows) Repair Tool.

Home > Error While > Error While Loading Shared Libraries Libz.so.1 Ubuntu. Error While Loading Shared Libraries: Libz.so.1. com/error-while/error-while.

Mar 25, 2016. I recently got very annoying error on freshly installed CentOS 7 machine when trying to use most up to date docker-compose ( at the moment of.

Mar 16, 2014. error while loading shared libraries: libz.so.1: cannot open shared object file:. Linux jenkins 3.11.0-18-generic #32-Ubuntu SMP Tue Feb 18.

Hi All, When trying to start snort, I get the following errors. Starting SNORTD p2p2 (snort): /usr/local/bin/snort: error while loading shared libraries: libdnet.1: cannot open shared object file: No such file or directory I just upgraded from.

I am facing an issue on ubuntu 12.04 as :. libz.so.1: cannot open shared object file:. error while loading shared libraries:.

. but by the time i create a new project i am getting the following error in. while loading shared libraries: libz.so.1:. error while loading shared libraries. 6.

"Build Your Own Linux (From Scratch)" walks users through building a basic Linux distribution. Presented by Linux Academy & Cloud.

Error 7011 Windows Work can happen any time, anywhere. GoToMeeting with HD video conferencing is a simple yet powerful way to collaborate in real time. The thing is: I have this 7011 error once more in my logs, dated back to the beginning of April. So putting back an image is not really an option, it would lead

Every time I invoke cmake a get as result: cmake: error while loading shared libraries: libcrypto.so.1.0.0: cannot.

If you still run into trouble like an error message that reads“aapt: error while loading shared libraries: libz.so.1: cannot openshared object file: No such file or directory” you need to installthe ia32-libs like this:

I'm trying to cross compile an opencv app on Ubuntu 14. Error while loading shared library libz.so.1 while. error while loading shared libraries: libz.so.

Ask Ubuntu is a question and answer site for Ubuntu users and. error with libz.so.1 on android studio. error while loading shared libraries: **libz.so.1:.

Error Loading Module Wdbcbexc.dll 0x8004100e How to Fix 0x8004100e in 2 Minutes – Easy to Use – (Highly Recommended) Feb 20, 2004. Visual Basic Run-time Error '48': Error in Loading DLL when I open Excel. E- Notebook for Biology · Bioanalytical Module · GeneSifter. Microsoft Visual Studio Error Lnk2001 Unresolved External Symbol Linker Tools Errors and Warnings Linker Tools Error.

. I can't use gcc until I fix a problem with zlib, usr/bin/gcc: error while loading shared libraries: libz.so.1:. [ubuntu] gcc shared library problem with zlib;

The libevent API provides a mechanism to execute a callback function when a specific event occurs on a file descriptor or after a timeout has been reached.

Microsoft Visual Studio Error Lnk2001 Unresolved External Symbol Linker Tools Errors and Warnings Linker Tools Error. found at Linker Tools Error LNK2019. unresolved external symbol 'symbol. Visual Studio; Microsoft. You may receive the "Linker tools error LNK2001" error. – Mar 29, 2017  · Linker Tools Error LNK2001 ‘unresolved external symbol __security_check_cookie ‘ To build the code, In Microsoft Visual Studio 2002, Microsoft Visual Studio

I was creating a new project out of nothing, for testing purpose, leaving all parameter to default (I didn’t made any code change), on a new ADT installation (Ubuntu.

Redhat server broken error while loading shared libraries: libz.so.1 – Nov 9, 2015. You don't say which version of Red Hat you are using so I will assume a recent version of EL6. If you are using a different version you will need.

Hi, Can any one help me ,how to rectify the below problem?.. "error while loading shared libraries: libxerces-c.so.28: cannot open shared object file: No such file or directory" Im using "ubuntu 10.04" (64 bit)

Update While what I write below is true as a general answer about shared libraries, I think the most frequent cause of these sorts of message is because you’ve.

RECOMMENDED: Click here to fix Windows errors and improve system performance