Error C2227 Left Of Must Point To Class/struct/union/generic Type

RECOMMENDED: If you have Windows errors then we strongly recommend that you download and run this (Windows) Repair Tool.

c:projectsmesa-masterincludec11threads_win32.h(151): error C2227: left of '- >sec' must point to class/struct/union/generic type

Linux Rar Ignore Crc Error Fast File Compression in Linux – CRC Error and Steps for. – In this article we learn about the source of the CRC Error (Cyclic Redundancy Check Error). Linux File Compression – ZIP and RAR; Linux File Compression. Changes in 5.0 This release comes with a new user interface which works better with touch devices

error C2027: use of undefined type 'QMouseEvent': see declaration. error C2227: left of '->button' must point to class/struct/union/generic type

Nov 12, 2012  · FYI – This is not C++, it’s C++/CLI which is a Microsoft.NET language.

Here is the key point of the article. Applying this to the question of. holding fast to familiar ways of reading the Bible is the core pillar of the evangelical narrative structure. And there you have the problem facing evangelicalism in a nutshell.

Card Reader Lookup Error Shutdown 'Error message concerning Card Reader Lookup', with 5 Comments. This occurs if the resource manager attempts to cancel a command to the smart card reader during shutdown of the smart card service or after a smart card is removed from the smart card reader and the command could. % Oracle Technology Network is the ultimate,

home > topics > c / c++ > questions > error c2227: left of '->chassisid' must point to class/struct/union/generic type. Inheritance error: class Foo has no attribute "bar". Members of the error class/object. Error 'Class already exists' when creating windows forms.

Error C2302: left of '.~identifier' must have class/struct/union type. requested 6 years ago by errorbase (170,010 points).

Error Message; Compiler Error C2200 ‘function’: function has already been defined: Compiler Error C2201 ‘identifier’: must have external linkage in order to be.

It seems like it was only yesterday that the Pediatric Brain Tumor Foundation listed the first-ever U.S. Honda Civic Type R for auction on Bring-A-Trailer. by a whopping $144,000 with seven days still left to go. Bring-A-Trailer confirmed.

This is the sixth edition of The Class Action Chronicle, a quarterly publication that provides an analysis of recent class action trends, along with a summary of class certification and Class Action Fairness Act rulings issued during each.

Amazon is an unstoppable beast, consuming all industries that are ripe for disruption and unfortunate enough to cross its path. On Monday, its latest victim was the struggling food delivery service Blue Apron. For 20 years, Whole Foods.

Windows Xp Installer Error 2869 (Recommended) Installation Error Fixer. Fix Installation Error Now Gdb Symbol Lookup Error Unix / Linux Useful Commands – Learning fundamentals of UNIX in simple and easy steps : A beginner’s tutorial containing complete knowledge of Getting Started, Unix. Strong passwords that include a minimum number of characters and the use of numbers and symbols are

. undeclared identifier mainwindow.cpp:32: error: C2227: left of '->setText' must point to class/struct/union/generic type type is 'unknown-type'.

Ah you need to declare the Character class before the Runner class – add a line "class Character;" just before it in game.h – Rob Agar Mar 16 '11 at 4:41. C++ classes query error : left of "" must point to class/struct/union. 1.

simdialog.cpp:21: error: C2227: left of '->setupUi' must point to class/struct/union/ generic type. d_stranz. 3rd January 2013, 18:35. @ben: I think.

To check whether everything is working ok, we will try to create a database, called mydb. Open up your command prompt and type "C:Program FilesPostgreSQL9.0bin.

The scope of this article is about how to dynamically change the window’s title from anywhere. E.g. a text editor probably wants to show the file path in the title.

Form1.h(145): error C2227: left of '->Text' must point to class/struct/union/generic type. The error says that the variable to the left of the -> must be a pointer. In your case: double investment = Convert::ToDouble (Investment->Text)

.error C2065: 'GEngine' : undeclared identifier,error C2227: left of '->GameViewport' must point to class/struct/union/generic type ?? Why won't C++ compile. End of Stream Encountered. Class extending from UBTDecorator_Blackboard giving errors. error in create new classs.

#6457 (MySQL driver build problems with Visual Studio 2015) – GDAL –. file ogrmysqltablelayer.cpp) D:buildmysql-5.7.12-win32includemy_global.h( 703): error C2227: left of '->tv' must point to class/struct/union/generic type.

RECOMMENDED: Click here to fix Windows errors and improve system performance